{"text_format":"1","workbook":"xlsx","n_sheets":4,"sheets":["Résumé","Actions","Communication","Fonctions"],"not_rendered":{"charts":0,"images":0,"macros":0,"external_links":0,"defined_names":0,"comments":0,"pivot_tables":0},"unopened":[],"bounds":{"document_bytes":16777216,"sheet_cells":100000,"rows_first":2000,"rows_last":500,"rows_between":2000,"halvings":0,"cell_chars":16384,"cell_head_chars":4096},"cells_cut":0,"cells_raw":0,"read":"whole","date_system":"1900"}

{"sheet":"Résumé","index":0,"n_rows":42,"n_cols":8,"rows_kept":42,"cut":false,"hidden":false,"merged":[[31,0,31,6],[32,0,32,6],[33,0,33,6],[28,0,28,6],[29,0,29,6],[34,0,34,6],[30,0,30,6],[1,0,5,9],[7,3,7,4],[18,0,18,5],[19,0,19,4],[25,0,25,6],[21,0,21,6],[20,0,20,6],[14,1,14,8],[15,1,15,8],[26,0,26,6],[27,0,27,6],[22,0,22,6],[23,0,23,6],[24,0,24,6],[35,0,35,6],[40,0,40,6],[41,0,41,6],[44,0,44,4],[45,0,45,4],[39,0,39,6],[37,0,37,6],[36,0,36,6],[38,0,38,6],[49,0,49,4],[56,0,56,4],[57,0,57,4],[58,0,58,4],[51,0,51,4],[52,0,52,4],[53,0,53,4],[46,0,46,4],[47,0,47,4],[48,0,48,4],[42,0,42,4],[43,0,43,4],[72,0,72,4],[73,0,73,4],[54,0,54,4],[55,0,55,4],[50,0,50,4],[61,0,61,4],[59,0,59,4],[60,0,60,4],[79,0,79,4],[62,0,62,4],[75,0,75,4],[76,0,76,4],[77,0,77,4],[78,0,78,4],[74,0,74,4],[63,0,63,4],[64,0,64,4],[65,0,65,4],[66,0,66,4],[67,0,67,4],[68,0,68,4],[69,0,69,4],[70,0,70,4],[71,0,71,4]]}
[]
["Fiche budgétaire détaillé du programme annuel d'actions à l'année N à remplir et à annexer au formulaire de demande de subvention Groupement d'entreprises et Chambre de commerce mixte"]
[]
[]
[]
[]
[]
[]
[null,"Nom du demandeur :",null,null,"Année du programme d'actions :",null,null,"Date :"]
[]
[]
[null,"Nombre d'entreprises membres du Groupement :\n",null,null,"Nombre d'entreprises wallonnes membres du Groupement :",null,null,"Secteur(s) que représente le demandeur :"]
[null," (la liste doit être jointe à la demande) "]
[]
[null,"1.\tQuelle est votre stratégie internationale et quel impact votre projet de développement à l'étranger pourrait-il avoir pour le secteur que vous représentez, vos membres, ainsi que sur l'économie wallonne en termes de création ou de maintien d'emplois, de développement de la production, d'innovation, d'investissement et de visibilité internationale ?"]
[]
[]
[]
["Budget prévisionnel - résumé"]
[]
["Type d'actions programmées à l'international",null,null,null,null,null,null,"Budget estimé"]
[" A -  Mission individuelle de prospection et de promotion à l'étranger",null,null,null,null,null,null,{"$f":"SUMIF(Actions!$C$13:$C$355,Fonctions!G3,Actions!$F$28:$F$370)","v":0}]
[" B -  Mission collective de prospection et de promotion à l'étranger",null,null,null,null,null,null,{"$f":"SUMIF(Actions!$C$13:$C$355,Fonctions!G4,Actions!$F$28:$F$370)","v":0}]
[" C -  Participation individuelle active à un congrés ou conférence à l'étranger avec prise de parole",null,null,null,null,null,null,{"$f":"SUMIF(Actions!$C$13:$C$355,Fonctions!G5,Actions!$F$28:$F$370)","v":0}]
[" D -  Participation individuelle en tant qu'exposant à une foire ou salon spécialisé à l'étranger"]
["D.1 - Participation physique",null,null,null,null,null,null,{"$f":"SUMIF(Actions!$C$13:$C$355,Fonctions!G6,Actions!$F$28:$F$370)","v":0}]
["D.2 - Participation hybride",null,null,null,null,null,null,{"$f":"SUMIF(Actions!$C$13:$C$355,Fonctions!G7,Actions!$F$28:$F$370)","v":0}]
["D.3 - Participation virtuelle",null,null,null,null,null,null,{"$f":"SUMIF(Actions!$C$13:$C$355,Fonctions!G8,Actions!$F$28:$F$370)","v":0}]
[" E -  Participation individuelle en tant qu'exposant pour la première fois à une fois ou salon à l'étranger"]
["E.1 - Participation physique",null,null,null,null,null,null,{"$f":"SUMIF(Actions!$C$13:$C$355,Fonctions!G9,Actions!$F$28:$F$370)","v":0}]
["E.2 - Participation hybride",null,null,null,null,null,null,{"$f":"SUMIF(Actions!$C$13:$C$355,Fonctions!G10,Actions!$F$28:$F$370)","v":0}]
[" F -  Organisation d'un stand collectif à l'étranger"]
["F.1 - Participation physique",null,null,null,null,null,null,{"$f":"SUMIF(Actions!$C$13:$C$355,Fonctions!G11,Actions!$F$28:$F$370)","v":0}]
["F.2 - Participation hybride",null,null,null,null,null,null,{"$f":"SUMIF(Actions!$C$13:$C$355,Fonctions!G12,Actions!$F$28:$F$370)","v":0}]
["F.3 - Participation virtuelle",null,null,null,null,null,null,{"$f":"SUMIF(Actions!$C$13:$C$355,Fonctions!G13,Actions!$F$28:$F$370)","v":0}]
[" G -  Invitation de décideurs étrangers en Belgique",null,null,null,null,null,null,{"$f":"SUMIF(Actions!$C$13:$C$355,Fonctions!G14,Actions!$F$28:$F$370)","v":0}]
[" H -  Organisation de séminaires en Belgique ou à l'étranger",null,null,null,null,null,null,{"$f":"SUMIF(Actions!$C$13:$C$355,Fonctions!G15,Actions!$F$28:$F$370)","v":0}]
[" I -  Support de communication destiné à faire connaître vos membres wallons à l'étranger",null,null,null,null,null,null,{"$f":"Communication!F28","v":0}]
[]
["Total du budget général estimé HTVA",null,null,null,null,null,null,{"$f":"SUM(H22:H38)","v":0}]
["Application de la quote-part [ x % ]"]
["50% d'intervention financière de l'AWEX",null,null,null,null,null,null,{"$f":"H40*0.5","v":0}]

{"sheet":"Actions","index":1,"n_rows":370,"n_cols":20,"rows_kept":370,"cut":false,"hidden":false,"merged":[[318,6,318,8],[319,6,319,8],[333,6,333,8],[336,6,336,8],[337,6,337,8],[351,6,351,8],[354,6,354,8],[355,6,355,8],[369,6,369,8],[264,6,264,8],[265,6,265,8],[279,6,279,8],[282,6,282,8],[283,6,283,8],[297,6,297,8],[300,6,300,8],[301,6,301,8],[315,6,315,8],[210,6,210,8],[211,6,211,8],[225,6,225,8],[228,6,228,8],[229,6,229,8],[243,6,243,8],[246,6,246,8],[247,6,247,8],[261,6,261,8],[135,6,135,8],[192,6,192,8],[193,6,193,8],[207,6,207,8],[138,6,138,8],[139,6,139,8],[153,6,153,8],[156,6,156,8],[157,6,157,8],[171,6,171,8],[174,6,174,8],[175,6,175,8],[189,6,189,8],[81,6,81,8],[84,6,84,8],[85,6,85,8],[99,6,99,8],[102,6,102,8],[103,6,103,8],[117,6,117,8],[120,6,120,8],[121,6,121,8],[1,0,5,5],[7,3,7,4],[8,1,8,2],[11,0,11,3],[12,0,12,1],[12,2,12,3],[12,4,12,5],[30,6,30,8],[31,6,31,8],[12,6,12,8],[13,6,13,8],[27,6,27,8],[13,0,13,3],[14,0,26,3],[14,4,26,4],[27,0,27,4],[32,0,44,3],[32,4,44,4],[45,0,45,4],[47,0,47,3],[48,0,48,1],[48,2,48,3],[48,4,48,5],[29,0,29,3],[30,0,30,1],[30,2,30,3],[30,4,30,5],[31,0,31,3],[45,6,45,8],[48,6,48,8],[66,0,66,1],[66,2,66,3],[66,4,66,5],[67,0,67,3],[68,0,80,3],[68,4,80,4],[49,0,49,3],[50,0,62,3],[50,4,62,4],[63,0,63,4],[65,0,65,3],[49,6,49,8],[63,6,63,8],[66,6,66,8],[67,6,67,8],[85,0,85,3],[86,0,98,3],[86,4,98,4],[99,0,99,4],[101,0,101,3],[102,0,102,1],[102,2,102,3],[102,4,102,5],[81,0,81,4],[83,0,83,3],[84,0,84,1],[84,2,84,3],[84,4,84,5],[120,0,120,1],[120,2,120,3],[120,4,120,5],[121,0,121,3],[122,0,134,3],[122,4,134,4],[103,0,103,3],[104,0,116,3],[104,4,116,4],[117,0,117,4],[119,0,119,3],[139,0,139,3],[140,0,152,3],[140,4,152,4],[153,0,153,4],[155,0,155,3],[156,0,156,1],[156,2,156,3],[156,4,156,5],[135,0,135,4],[137,0,137,3],[138,0,138,1],[138,2,138,3],[138,4,138,5],[174,0,174,1],[174,2,174,3],[174,4,174,5],[175,0,175,3],[176,0,188,3],[176,4,188,4],[157,0,157,3],[158,0,170,3],[158,4,170,4],[171,0,171,4],[173,0,173,3],[193,0,193,3],[194,0,206,3],[194,4,206,4],[207,0,207,4],[209,0,209,3],[210,0,210,1],[210,2,210,3],[210,4,210,5],[189,0,189,4],[191,0,191,3],[192,0,192,1],[192,2,192,3],[192,4,192,5],[228,0,228,1],[228,2,228,3],[228,4,228,5],[229,0,229,3],[230,0,242,3],[230,4,242,4],[211,0,211,3],[212,0,224,3],[212,4,224,4],[225,0,225,4],[227,0,227,3],[247,0,247,3],[248,0,260,3],[248,4,260,4],[261,0,261,4],[263,0,263,3],[264,0,264,1],[264,2,264,3],[264,4,264,5],[243,0,243,4],[245,0,245,3],[246,0,246,1],[246,2,246,3],[246,4,246,5],[282,0,282,1],[282,2,282,3],[282,4,282,5],[283,0,283,3],[284,0,296,3],[284,4,296,4],[265,0,265,3],[266,0,278,3],[266,4,278,4],[279,0,279,4],[281,0,281,3],[301,0,301,3],[302,0,314,3],[302,4,314,4],[315,0,315,4],[317,0,317,3],[318,0,318,1],[318,2,318,3],[318,4,318,5],[297,0,297,4],[299,0,299,3],[300,0,300,1],[300,2,300,3],[300,4,300,5],[336,0,336,1],[336,2,336,3],[336,4,336,5],[337,0,337,3],[338,0,350,3],[338,4,350,4],[319,0,319,3],[320,0,332,3],[320,4,332,4],[333,0,333,4],[335,0,335,3],[355,0,355,3],[356,0,368,3],[356,4,368,4],[369,0,369,4],[351,0,351,4],[353,0,353,3],[354,0,354,1],[354,2,354,3],[354,4,354,5]]}
[]
["Budget  du programme d'actions de l'année N à remplir et à annexer au formulaire de demande de subvention Groupement d'entreprises "]
[]
[]
[]
[]
[]
[]
[]
[]
[]
["Action 1."]
["Type d'actions :\n(Cliquez sur la case bleue pour dérouler le menu)",null,"Invitation de décideurs étrangers en Belgique",null,"Estimation budgétaire\nBasée sur les coûts éligibles par action",null,"Participants"]
["Intitulé de l'action, ville pays, date",null,null,null,"Frais éligibles ","Montants","Organisme, Nom et Fonction"]
["Description et objectif de l'action",null,null,null,{"$f":"IFERROR(IF(VLOOKUP(C13,Fonctions!$G$3:$H$16,2,FALSE)=\"\",\"\",VLOOKUP(C13,Fonctions!$G$3:$H$16,2,FALSE)),\"\")","v":"1. Nombre [max 3] x frais de déplacement et de séjour pour PAYS A\n2. Nombre [max 3] x frais de déplacement et de séjour pour PAYS B\n3. Nombre [max 3] x frais de déplacement et de séjour pour PAYS C"}]
[]
[]
[]
[]
[]
[]
[]
[]
[]
[]
[]
[]
["Sous-total 1. :",null,null,null,null,{"$f":"SUM(F15:F27)","v":0},null,null,null,null,null,null,null,null,null,null,null,null,null,"€"]
[null,null,null,null,null,null,null,null,null,null,null,null,null,null,null,null,null,null,null,"€"]
["Action 2."]
["Type d'actions :\n(Cliquez sur la case bleue pour dérouler le menu)",null,"Participation hybride individuelle pour la première fois en tant qu'exposant à une foire ou un salon à l'étranger",null,"Estimation budgétaire\nBasée sur les coûts éligibles par action",null,"Participants"]
["Intitulé de l'action, ville pays, date",null,null,null,"Frais éligibles ","Montants","Organisme, Nom et Fonction"]
["Description et objectif de l'action",null,null,null,{"$f":"IFERROR(IF(VLOOKUP(C31,Fonctions!$G$3:$H$16,2,FALSE)=\"\",\"\",VLOOKUP(C31,Fonctions!$G$3:$H$16,2,FALSE)),\"\")","v":"1. Frais de déplacement et de séjour du délégué en mission\n2. Droit d'inscription\n3. Coûts de conception de brochures digitales\n4. Coût de location de la surface du stand [m² x prix hors TVA]\n5. Coût d'aménagement du stand\n6. Frais de montage et démontage du stand\n7. Coût d'envoi de matériels ou d'animaux de démonstration [non-susceptible de transactions commerciales et rapatriés par des tiers professionels]"}]
[]
[]
[]
[]
[]
[]
[]
[]
[]
[]
[]
[]
["Sous-total 1. :",null,null,null,null,{"$f":"SUM(F33:F45)","v":0}]
[]
["Action 3."]
["Type d'actions :\n(Cliquez sur la case bleue pour dérouler le menu)",null,"Mission individuelle de prospection",null,"Estimation budgétaire\nBasée sur les coûts éligibles par action",null,"Participants"]
["Intitulé de l'action, ville pays, date",null,null,null,"Frais éligibles ","Montants","Organisme, Nom et Fonction"]
["Description et objectif de l'action",null,null,null,{"$f":"IFERROR(IF(VLOOKUP(C49,Fonctions!$G$3:$H$16,2,FALSE)=\"\",\"\",VLOOKUP(C49,Fonctions!$G$3:$H$16,2,FALSE)),\"\")","v":"1. Frais de déplacement et de séjour du délégué en mission\n2. Frais de déplacement et de séjour du second délégué en mission\n"}]
[]
[]
[]
[]
[]
[]
[]
[]
[]
[]
[]
[]
["Sous-total 1. :",null,null,null,null,{"$f":"SUM(F51:F63)","v":0}]
[]
["Action 4."]
["Type d'actions :\n(Cliquez sur la case bleue pour dérouler le menu)",null,"Mission individuelle de prospection",null,"Estimation budgétaire\nBasée sur les coûts éligibles par action",null,"Participants"]
["Intitulé de l'action, ville pays, date",null,null,null,"Frais éligibles ","Montants","Organisme, Nom et Fonction"]
["Description et objectif de l'action",null,null,null,{"$f":"IFERROR(IF(VLOOKUP(C67,Fonctions!$G$3:$H$16,2,FALSE)=\"\",\"\",VLOOKUP(C67,Fonctions!$G$3:$H$16,2,FALSE)),\"\")","v":"1. Frais de déplacement et de séjour du délégué en mission\n2. Frais de déplacement et de séjour du second délégué en mission\n"}]
[]
[]
[]
[]
[]
[]
[]
[]
[]
[]
[]
[]
["Sous-total 1. :",null,null,null,null,{"$f":"SUM(F69:F81)","v":0}]
[]
["Action 5."]
["Type d'actions :\n(Cliquez sur la case bleue pour dérouler le menu)",null,"Mission individuelle de prospection",null,"Estimation budgétaire\nBasée sur les coûts éligibles par action",null,"Participants"]
["Intitulé de l'action, ville pays, date",null,null,null,"Frais éligibles ","Montants","Organisme, Nom et Fonction"]
["Description et objectif de l'action",null,null,null,{"$f":"IFERROR(IF(VLOOKUP(C85,Fonctions!$G$3:$H$16,2,FALSE)=\"\",\"\",VLOOKUP(C85,Fonctions!$G$3:$H$16,2,FALSE)),\"\")","v":"1. Frais de déplacement et de séjour du délégué en mission\n2. Frais de déplacement et de séjour du second délégué en mission\n"}]
[]
[]
[]
[]
[]
[]
[]
[]
[]
[]
[]
[]
["Sous-total 1. :",null,null,null,null,{"$f":"SUM(F87:F99)","v":0}]
[]
["Action 6."]
["Type d'actions :\n(Cliquez sur la case bleue pour dérouler le menu)",null,"Mission individuelle de prospection",null,"Estimation budgétaire\nBasée sur les coûts éligibles par action",null,"Participants"]
["Intitulé de l'action, ville pays, date",null,null,null,"Frais éligibles ","Montants","Organisme, Nom et Fonction"]
["Description et objectif de l'action",null,null,null,{"$f":"IFERROR(IF(VLOOKUP(C103,Fonctions!$G$3:$H$16,2,FALSE)=\"\",\"\",VLOOKUP(C103,Fonctions!$G$3:$H$16,2,FALSE)),\"\")","v":"1. Frais de déplacement et de séjour du délégué en mission\n2. Frais de déplacement et de séjour du second délégué en mission\n"}]
[]
[]
[]
[]
[]
[]
[]
[]
[]
[]
[]
[]
["Sous-total 1. :",null,null,null,null,{"$f":"SUM(F105:F117)","v":0}]
[]
["Action 7."]
{"$rows_left_out":251}
{"sheet":"Communication","index":2,"n_rows":31,"n_cols":8,"rows_kept":31,"cut":false,"hidden":false,"merged":[[1,0,5,9],[7,3,7,4],[8,1,8,2],[11,1,11,5],[13,1,13,4],[13,7,13,10],[14,1,14,4],[14,7,14,10],[15,1,15,4],[15,7,15,10],[16,1,16,4],[16,7,16,10],[17,1,17,4],[17,7,17,10],[18,1,18,4],[18,7,18,10],[19,1,19,4],[19,7,19,10],[20,1,20,4],[20,7,20,10],[21,1,21,4],[21,7,21,10],[22,1,22,4],[22,7,22,10],[26,7,26,10],[30,1,30,5],[23,1,23,4],[23,7,23,10],[24,1,24,4],[24,7,24,10],[25,1,25,4],[25,7,25,10],[26,1,26,4]]}
[]
["Budget  du programme d'actions de l'année N à remplir et à annexer au formulaire de demande de subvention Groupement d'entreprises "]
[]
[]
[]
[]
[]
[]
[]
[]
[]
[null,"Support de communication et services de promotion digital"]
[]
[null,"1. Supports traditionnels",null,null,null,null,null,"Description et objectif du support communication"]
[null,"1° Coûts de production  et de trduction de brochures papiers ou digitales"]
[null,"2° Coûts de production d’insertions publicitaires dans des magazines papiers édités et distribués à l’étranger et des magazines digitaux (hors réseaux sociaux) à destination d’un public étranger"]
[null,"3° Coûts de production de capsules vidéos, audios et de visites virtuelles interactives"]
[null,"2. Supports digitaux"]
[null,"1° Coûts d'achat de listes d'adresses électroniques étrangères ;"]
[null,"2° Coûts de réalisation et d'envoi de courriels par un spécialiste du marketing sur internet;"]
[null,"3° Coûts d'achat de crédits d'envoi de courriels;"]
[null,"4° Coûts de prestations de centres d'appels pour des appels à l'étranger;"]
[null,"5° Coûts de réalisation d'un webinaire destiné à un public étranger par un spécialiste du marketing sur internet;"]
[null,"6° Coûts de référencement international sur des moteurs de recherche par un spécialiste du marketing sur internet;"]
[null,"7° Coûts d'achat de publicités et de référencement internationaux sur des moteurs de recherche, des réseaux sociaux et des plateformes en ligne;"]
[null,"8° Coûts de prestations d'influenceurs en ligne et de leaders d'opinion;"]
[null,"9° Coûts de prestations de spécialistes du marketing digital externes pour la gestion de profil d'entreprise à l'international sur les réseaux sociaux."]
[null,null,null,null,"Sous-total Com. :",{"$f":"SUM(F15:F17,F19:F27)","v":0}]
[]
[]
[null,"Annexe(s) bon de commande/devis/maquette)à joindre si vous en disposez lors de l'introduction de votre demande ou à envoyer durant l'année  de réalisation du programme d'actions"]

{"sheet":"Fonctions","index":3,"n_rows":16,"n_cols":8,"rows_kept":16,"cut":false,"hidden":true,"merged":[[1,6,1,7]]}
[null,null,"LISTE"]
[null,null,"Type d'actions",null,null,null,"INDEX"]
[null,null,"Mission individuelle de prospection",null,null,null,"Mission individuelle de prospection","1. Frais de déplacement et de séjour du délégué en mission\n2. Frais de déplacement et de séjour du second délégué en mission\n"]
[null,null,"Mission collective de prospection",null,null,null,"Mission collective de prospection","1. Frais de déplacement et de séjour du délégué en mission\n2. Frais de déplacement et de séjour du second délégué en mission\n3. Délégué(s) membre(s) participant(s) [1 par membre]\n4. Frais de déplacement collectif par bus \n5. Frais de location de salle"]
[null,null,"Participation individuelle active à un congrès ou conférence",null,null,null,"Participation individuelle active à un congrès ou conférence","1. Frais de déplacement et de séjour du délégué en mission\n2. Droit d'inscription (Plafond max 1.600 € hors TVA)"]
[null,null,"Participation physique individuelle en tant qu'exposant à une foire ou un salon à l'étranger",null,null,null,"Participation physique individuelle en tant qu'exposant à une foire ou un salon à l'étranger","1. Surface louée en m² [max 50m²]\n2. Prix Hors TVA par m² [max 400€/m²]\n"]
[null,null,"Participation hybride individuelle en tant qu'exposant à une foire ou un salon à l'étranger",null,null,null,"Participation hybride individuelle en tant qu'exposant à une foire ou un salon à l'étranger","1. Droit d'inscription au salon hybride\n2. Surface louée en m² [max 50m²]\n3. Prix Hors TVA par m² [max 400€/m²]\n4. Coûts de conception de brochures digitales [max 15.000€ sur 3 ans]\n"]
[null,null,"Participation virtuelle individuelle en tant qu'exposant à une foire ou un salon à l'étranger",null,null,null,"Participation virtuelle individuelle en tant qu'exposant à une foire ou un salon à l'étranger","1. Droit d'inscription au salon virtuel\n2. Coûts de conception de brochures digitales [max 15.000€ sur 3 ans]"]
[null,null,"Participation physique individuelle pour la première fois en tant qu'exposant à une foire ou un salon à l'étranger",null,null,null,"Participation physique individuelle pour la première fois en tant qu'exposant à une foire ou un salon à l'étranger","1. Frais de déplacement et de séjour du délégué en mission\n2. Droit d'inscription\n3. Coût de location de la surface du stand [m² x prix hors TVA]\n4. Coût d'aménagement du stand\n5. Frais de montage et démontage du stand\n6. Coût d'envoi de matériels ou d'animaux de démonstration [non-susceptible de transactions commerciales et rapatriés par des tiers professionels]"]
[null,null,"Participation hybride individuelle pour la première fois en tant qu'exposant à une foire ou un salon à l'étranger",null,null,null,"Participation hybride individuelle pour la première fois en tant qu'exposant à une foire ou un salon à l'étranger","1. Frais de déplacement et de séjour du délégué en mission\n2. Droit d'inscription\n3. Coûts de conception de brochures digitales\n4. Coût de location de la surface du stand [m² x prix hors TVA]\n5. Coût d'aménagement du stand\n6. Frais de montage et démontage du stand\n7. Coût d'envoi de matériels ou d'animaux de démonstration [non-susceptible de transactions commerciales et rapatriés par des tiers professionels]"]
[null,null,"Organisation d'un stand collectif physique à l'étranger",null,null,null,"Organisation d'un stand collectif physique à l'étranger","1. Frais de déplacement et de séjour du délégué en mission\n2. Frais de déplacement et de séjour du second délégué en mission\n3. Droit d'inscription\n4. Coût de location de la surface du stand [m² x prix hors TVA - max 400€/m²]\n5. Coût d'aménagement du stand\n6. Frais de montage et démontage du stand\n7. Coût d'envoi de matériels ou d'animaux de démonstration [non-susceptible de transactions commerciales et rapatriés par des tiers professionnels]\n"]
[null,null,"Organisation d'un stand collectif hybride à l'étranger",null,null,null,"Organisation d'un stand collectif hybride à l'étranger","1. Frais de déplacement et de séjour du délégué en mission\n2. Frais de déplacement et de séjour du second délégué en mission\n3. Droit d'inscription\n4. Coût de location de la surface du stand [m² x prix hors TVA - max 400€/m²]\n5. Coût d'aménagement du stand\n6. Frais de montage et démontage du stand\n7. Coût d'envoi de matériels ou d'animaux de démonstration [non-susceptible de transactions commerciales et rapatriés par des tiers professionnels]\n8. Frais d'une entreprise externe spécialisée dans l'organisation d'évènements hybrides/virtuels [max 15.000 hors TVA]\n"]
[null,null,"Organisation d'un stand collectif virtuel à l'étranger",null,null,null,"Organisation d'un stand collectif virtuel à l'étranger","1. Droit d'inscription\n2. Frais d'une entreprise externe spécialisée dans l'organisation d'évènements hybrides/virtuels [max 15.000 hors TVA]"]
[null,null,"Organisation de séminaires en Belgique ou à l'étranger",null,null,null,"Invitation de décideurs étrangers en Belgique","1. Nombre [max 3] x frais de déplacement et de séjour pour PAYS A\n2. Nombre [max 3] x frais de déplacement et de séjour pour PAYS B\n3. Nombre [max 3] x frais de déplacement et de séjour pour PAYS C"]
[null,null,"Support de communication",null,null,null,"Organisation de séminaires en Belgique ou à l'étranger","1. Frais de déplacement et de séjour de l'orateur\n2. Frais de déplacement et de séjour du second orateur\n3. Frais de location de salle\n4. Frais de réalisation de supports d'invitations\n5. Frais de location de matériel informatique ou audiovisuel\n"]
[null,null,null,null,null,null,"Support de communication","- SUPPORTS TRADITIONNELS\n1. Coûts de production et de traduction de brochures papiers/digitales\n2. Coûts de productions d'insertions publicitaires dans des magazines papiers édités et distribués à l'étranger et des magazines digitaux\n3. Coûts de productions de capsules vidéos, audios ou de visites virtuelles interactives\n- SUPPORTS DIGITAUX\n1. Coûts d'achat de liste d'adresses éléctroniques étrangères\n2. Coûts de réalisation et d'envoi de courriels par un spécialiste du marketing sur internet\n3. Coûts d'achat de crédits d'envoi de courriels\n4. Coûts de prestations de centres d'appels pour des appels à l'étranger\n5. Coûts de réalisation d'un webinaire destiné à un public étranger par un spécialiste du marketing sur internet\n6. Coûts de référencement international sur des moteurs de recherche par un spécialiste du marketing sur internet\n7. Coûts d'achat de publicités et de référencement internationaux sur des moteurs de recherche, des réseaux sociaux et des plateformes en ligne\n8. Coûts de prestations d'influenceurs en ligne et de leaders d'opinios\n9. Coûts de prestations de spécialistes du marketing digital externes pour la gestion de profil d'entreprise à l'internation sur les réseaux sociaux"]